TAP Matrix - Wed Feb 13 21:54:03 2008 GMT
--- 
build_info:
This is Perl6 User's Golfing System, version 6.2.13, October 17, 2006 (r19912) built for i686-linux

Summary of pugs configuration:
	archlib: /usr/local/lib/perl6/i686-linux
	archname: i686-linux
	bin: /usr/local/bin
	cc: gcc version 4.2.1 (Debian 4.2.1-5)
	embedded: /usr/local/bin/perl noparrot nohaskell
	exe_ext: 
	file_sep: /
	ghc: /usr/bin/ghc 6.6.1 readline nohsplugins threads
	installarchlib: /usr/local/lib/perl6/i686-linux
	installbin: /usr/local/bin
	installman1dir: /usr/local/share/man/man1
	installman3dir: /usr/local/share/man/man3
	installprivlib: /usr/local/lib/perl6
	installscript: /usr/local/bin
	installsitearch: /usr/local/lib/perl6/site_perl/i686-linux
	installsitebin: /usr/local/bin
	installsitelib: /usr/local/lib/perl6/site_perl
	installsiteman1dir: /usr/local/share/man/man1
	installsiteman3dir: /usr/local/share/man/man3
	osname: linux
	pager: /usr/bin/less
	path_sep: :
	perl5_path: /usr/local/bin/perl
	perl_compiler: pugs
	perl_revision: 6
	perl_subversion: 0
	perl_version: 0
	prefix: /usr/local
	privlib: /usr/local/lib/perl6
	pugs_revision: 19912
	pugs_version: Perl6 User's Golfing System, version 6.2.13, October 17, 2006 (r19912)
	pugs_versnum: 6.2.13
	pugspath: /usr/local/bin/pugs
	regex_engine: default
	scriptdir: /usr/local/bin
	sitearch: /usr/local/lib/perl6/site_perl/i686-linux
	sitebin: /usr/local/bin
	sitelib: /usr/local/lib/perl6/site_perl
	siteprefix: /usr/local
	sitescript: /usr/local/bin
	sourcedir: /home/agentzh/svn-pugs
	uname: Linux 2.6.18-6-xen-686 i686

@*INC:
blib6/lib
/usr/local/lib/perl6/i686-linux
/usr/local/lib/perl6
/usr/local/lib/perl6/site_perl/i686-linux
/usr/local/lib/perl6/site_perl
/usr/local/lib/perl6/auto/pugs/perl6/lib
/usr/local/lib/perl6/site_perl/auto/pugs/perl6/lib
.


config: 
  concurrent: 1
  exclude: 
    - Disabled
  exclude_re: !!perl/regexp (?-xism:(Disabled))
  include: []

  include_re: !!perl/regexp (?-xism:\.(t)$)
  output-file: smoke.yml
  pugs-path: "util/limited_pugs "
  recurse: 1
  shuffle: 0
  test_count: 857
revision: 19912
smoker: 
  email: agentzh@gmail.com (Agent Zhang)
  name: auto-smoker on feather
timing: 
  duration: 1239 (20.65 min)
  end: 1202939640 (Wed Feb 13 22:54:00 2008)
  start: 1202938401 (Wed Feb 13 22:33:21 2008)
Test file Test cases %
TOTAL 857 files 19328 test cases: 18024 ok, 1304 failed, 1909 todo, 769 skipped and 30 unexpectedly succeeded 93.25%
ext/Algorithm-TokenBucket/t/test.t OK
               
100.00%
ext/Automata-Cellular/t/ca.t OK
           
100.00%
ext/Automata-Cellular/t/rule.t OK
           
100.00%
ext/Benchmark/t/basic.t OK
       
100.00%
ext/CGI/t/Dump.t OK
 
100.00%
ext/CGI/t/basic.t OK
                                           
100.00%
ext/CGI/t/encode_decode.t OK
                                               
100.00%
ext/CGI/t/escapeHTML.t OK
   
100.00%
ext/CGI/t/header.t OK
                         
100.00%
ext/CGI/t/new.t OK
     
100.00%
ext/CGI/t/params.t OK
                                                           
100.00%
ext/CGI/t/redirect.t OK
                 
100.00%
ext/CGI/t/remote.t OK
           
100.00%
ext/CGI/t/server.t OK
         
100.00%
ext/CGI/t/util.t OK
                       
100.00%
ext/Cipher/t/0-cipher-oo.t OK
                       
100.00%
ext/Cipher/t/1-cipher-functional.t OK
         
100.00%
ext/Cipher/t/1-cipher-procedural.t OK
     
100.00%
ext/Cipher/t/arcfour.t OK
                                               
100.00%
ext/Cipher/t/caesar-all.t OK
         
100.00%
ext/Cipher/t/caesar-julius.t OK
     
100.00%
ext/Cipher/t/caesar-rot13.t OK
   
100.00%
ext/Config-Tiny/t/basic.t OK
                                 
100.00%
ext/DateTime-Set/t/basic.t OK
 
100.00%
ext/DateTime/t/basic.t FAILED
                                                                       
75.00%
ext/DateTime/t/day_of_year.t OK
                               
100.00%
ext/DateTime/t/last-day.t OK
                                                                                               
100.00%
ext/DateTime/t/quarter.t OK
                                                               
100.00%
ext/DateTime/t/ymd.t OK
                                                                                               
100.00%
ext/FA-DFA/t/DFA.t OK
             
100.00%
ext/File-Find/t/01_use.t OK
 
100.00%
ext/File-Spec/t/01_file_spec_test.t OK
   
100.00%
ext/File-Spec/t/10_unix_test.t OK
                                                                       
                                                                       
                                                                   
100.00%
ext/File-Spec/t/20_win32_test.t OK
                                                                                   
                                                                                   
                                                                                   
                                                                             
100.00%
ext/File-Spec/t/30_cwd.t OK
   
100.00%
ext/File-Util/t/01.use.t OK
     
100.00%
ext/File-Util/t/02.files.t FAILED
     
66.67%
ext/File-Util/t/03.dirs.t FAILED
             
100.00%
ext/File-Util/t/04.portable.t FAILED
                                                                                   
100.00%
ext/File-Util/t/05.methods.t FAILED
                   
100.00%
ext/FindBin/t/01_use.t OK
 
100.00%
ext/Getopt-Std/t/01-basic.t OK
                             
100.00%
ext/HTML-Entities/t/entities.t OK
                     
100.00%
ext/HTTP-Server-Simple/t/01_use.t OK
 
100.00%
ext/HTTP-Server-Simple/t/subclass.t FAILED
 
0.00%
ext/HTTP/t/00_Compile.t FAILED
 
0.00%
ext/Kwid-Event-Parser/t/basic.t OK
 
100.00%
ext/Locale-KeyedText/t/LKT_00_Compile.t OK
           
100.00%
ext/Log-Selective/t/1-basic.t OK
       
100.00%
ext/Log-Selective/t/all.t OK
       
100.00%
ext/Log-Selective/t/autotag.t OK
       
100.00%
ext/Log-Selective/t/env.t OK
       
100.00%
ext/Log-Selective/t/messages.t OK
         
100.00%
ext/MIME-Base64/t/Base64.t OK
     
100.00%
ext/Math-Random-Kiss/t/rand.t OK
                                                   
100.00%
ext/Module-Pluggable-Fast/t/01_use.t OK
 
100.00%
ext/Muldis-DB/t/MDB_00_Compile.t OK
                   
100.00%
ext/Muldis-DB/t/MDB_50_Validate_Example.t OK
                         
100.00%
ext/Net-IRC/t/basic.t OK
   
100.00%
ext/Parse-Rule/t/combinators.t OK
                                                                                 
                                                                                 
100.00%
ext/Perl-Compiler/t/01_load.t OK
       
100.00%
ext/Perl-Compiler/t/NameGen.t OK
           
100.00%
ext/Perl-Compiler/t/PIL.t OK
   
100.00%
ext/Perl6-Container-Array/t/array-fetch-store.t OK
                               
100.00%
ext/Perl6-Container-Array/t/array-lazy.t OK
                                                                 
100.00%
ext/Perl6-Container-Array/t/array-operations.t OK
                                                                             
100.00%
ext/Perl6-Grammar/t/basic.t FAILED
                                                 
88.00%
ext/Perl6-Value-List/t/array-lazy-overloaded.t OK
                     
100.00%
ext/Perl6-Value-List/t/array-lazy.t OK
                         
100.00%
ext/Perl6-Value-List/t/array-operations.t OK
                                                       
100.00%
ext/Perldoc/t/00-compile.t OK
           
100.00%
ext/Perldoc/t/01-dom.t OK
                             
100.00%
ext/Pod-Event-Parser/t/basic.t OK
         
100.00%
ext/Pod-Event-Parser/t/basic_html.t OK
     
100.00%
ext/Pod-Event-Parser/t/complex.t OK
     
100.00%
ext/Recurrence/t/recurrence-grep.t OK
         
100.00%
ext/Recurrence/t/recurrence-negate.t OK
               
100.00%
ext/Recurrence/t/recurrence.t OK
                                                                                 
100.00%
ext/Recurrence/t/unicode.t OK
                   
100.00%
ext/Set-Infinite/t/set-infinite-functional.t FAILED
                                                   
50.00%
ext/Set-Infinite/t/set-infinite-recurrence.t OK
                                                     
100.00%
ext/Set-Infinite/t/set-infinite.t FAILED
                                                                                               
27.08%
ext/Set-Relation/t/00_Compile.t OK
   
100.00%
ext/Set/t/basic.t OK
                                       
100.00%
ext/Set/t/hash.t OK
                                       
100.00%
ext/Set/t/operations.t OK
                                                       
100.00%
ext/Set/t/overload.t FAILED
                                                                           
94.74%
ext/Set/t/unicodeoverload.t OK
                                                                   
100.00%
ext/Span/t/span-code.t OK
                                       
100.00%
ext/Span/t/span-functional.t OK
                       
100.00%
ext/Span/t/span.t FAILED
                                                               
                                                             
28.57%
ext/Span/t/unicode.t OK
                         
100.00%
ext/Sudoku/t/04x04-cross.t OK
 
100.00%
ext/Sudoku/t/04x04.t OK
     
100.00%
ext/Sys-Statistics-Linux/t/03SysInfo.t OK
                   
100.00%
ext/Sys-Statistics-Linux/t/04CpuStats.t OK
           
100.00%
ext/Sys-Statistics-Linux/t/05ProcStats.t OK
     
100.00%
ext/Sys-Statistics-Linux/t/06MemStats.t OK
                       
100.00%
ext/Sys-Statistics-Linux/t/07PgSwStats.t OK
       
100.00%
ext/Sys-Statistics-Linux/t/08Netstats.t OK
                                   
100.00%
ext/Sys-Statistics-Linux/t/09SockStats.t OK
         
100.00%
ext/Sys-Statistics-Linux/t/10DiskStats.t OK
               
100.00%
ext/Sys-Statistics-Linux/t/11DiskUsage.t OK
         
100.00%
ext/Sys-Statistics-Linux/t/12LoadAVG.t OK
     
100.00%
ext/Sys-Statistics-Linux/t/13FileStats.t OK
                   
100.00%
ext/Sys-Statistics-Linux/t/14Processes.t OK
                                                                 
100.00%
ext/Test-Builder/t/001_load.t OK
         
100.00%
ext/Test-Builder/t/010_Test_Builder.t OK
         
100.00%
ext/Test-Builder/t/020_Test_Builder_Test.t OK
       
100.00%
ext/Test-Builder/t/021_Test_Builder_Test_Pass.t OK
                   
100.00%
ext/Test-Builder/t/022_Test_Builder_Test_Fail.t OK
                   
100.00%
ext/Test-Builder/t/023_Test_Builder_Test_Skip.t OK
                         
100.00%
ext/Test-Builder/t/024_Test_Builder_Test_TODO.t OK
                       
100.00%
ext/Test-Builder/t/030_Test_Builder_Output.t OK
     
100.00%
ext/Test-Builder/t/040_Test_Builder_TestPlan.t OK
                 
100.00%
ext/Test-Builder/t/050_Test_Builder_Tester.t OK
               
100.00%
ext/Test/t/1-basic.t OK
                                                           
                                                           
100.00%
ext/Test/t/2-force_todo.t OK
                     
100.00%
ext/Test/t/3-output.t OK
 
100.00%
ext/Text-Glob/t/01_use.t OK
 
100.00%
ext/Text-Glob/t/02_glob_to_regex.t OK
 
100.00%
ext/Tree/t/basic.t OK
                                                       
100.00%
ext/Tree/t/extended_tests.t OK
                                                                                     
                                                                                     
                                                                                     
                                                                                     
                                                                                 
100.00%
ext/Tree/t/height_test.t OK
                                                         
                                                       
100.00%
ext/Tree/t/subclass.t OK
 
100.00%
ext/Tree/t/visitor.t FAILED
 
0.00%
ext/Tree/t/width_test.t OK
                                                                 
                                                                 
100.00%
ext/URI/t/escape.t FAILED
               
0.00%
ext/WTemplate/t/basic.t OK
     
100.00%
ext/Web/t/00_Compile.t FAILED
 
0.00%
ext/fp/t/functions.t OK
         
100.00%
ext/fp/t/operators.t OK
                             
100.00%
ext/lib/t/basic.t OK
                   
100.00%
ext/libwww-perl/t/api.t OK
           
100.00%
ext/libwww-perl/t/getprint.t FAILED
     
33.33%
ext/libwww-perl/t/live.t FAILED
                                                               
3.12%
ext/re/t/basic.t OK
         
100.00%
t/01-sanity/01-tap.t OK
                   
100.00%
t/01-sanity/02-counter.t OK
       
100.00%
t/01-sanity/03-equal.t OK
       
100.00%
t/01-sanity/04-if.t OK
   
100.00%
t/01-sanity/05-sub.t OK
       
100.00%
t/01-sanity/06-use.t OK
 
100.00%
t/01-sanity/07-binding.t OK
     
100.00%
t/01-sanity/07-defined.t OK
   
100.00%
t/01-sanity/07-end-blocks.t OK
   
100.00%
t/01-sanity/07-for.t OK
                 
100.00%
t/01-sanity/07-isa.t OK
     
100.00%
t/01-sanity/07-range.t OK
       
100.00%
t/01-sanity/07-ref.t OK
     
100.00%
t/01-sanity/07-simple-multisubs.t OK
   
100.00%
t/01-sanity/07-split.t OK
       
100.00%
t/01-sanity/07-substr.t OK
 
100.00%
t/01-sanity/07-try.t OK
       
100.00%
t/02-test-pm/0-compile.t OK
 
100.00%
t/02-test-pm/1-basic.t OK
                                                           
                                                           
100.00%
t/02-test-pm/2-force_todo.t OK
                     
100.00%
t/02-test-pm/3-output.t OK
 
100.00%
t/02-test-pm/4-version_lt.t OK
           
100.00%
t/02-test-pm/5-todo.t OK
                 
100.00%
t/blocks/arg_ref_type_preservation.t OK
               
100.00%
t/blocks/bare_block_with_dollar_underscore.t OK
 
100.00%
t/blocks/closure.t OK
               
100.00%
t/blocks/code_blocks_as_sub_args.t OK
   
100.00%
t/blocks/currying.t OK
                         
100.00%
t/blocks/defaults.t OK
   
100.00%
t/blocks/dollar_underscore.t OK
     
100.00%
t/blocks/goto.t FAILED
 
0.00%
t/blocks/implicit_parameters.t OK
                           
100.00%
t/blocks/lexical_subs.t OK
           
100.00%
t/blocks/loopscope.t OK
                       
100.00%
t/blocks/lvalue_subroutines.t FAILED
                           
85.71%
t/blocks/meth_vs_sub_call.t OK
     
100.00%
t/blocks/multi_named_vs_pos.t FAILED
                                                   
76.92%
t/blocks/multi_sub.t FAILED
                                           
63.64%
t/blocks/multidimensional_arglists.t OK
             
100.00%
t/blocks/nested_named.t FAILED
     
66.67%
t/blocks/param_signature.t OK
 
100.00%
t/blocks/pointy.t OK
                           
100.00%
t/blocks/primitive_named_params.t OK
 
100.00%
t/blocks/proto.t FAILED
           
0.00%
t/blocks/recurse.t OK
                         
100.00%
t/blocks/return.t OK
               
100.00%
t/blocks/return_function.t OK
       
100.00%
t/blocks/scoped_named_subs.t OK
               
100.00%
t/blocks/slurpy_code_param.t OK
           
100.00%
t/blocks/slurpy_param.t OK
                                                   
100.00%
t/blocks/splat_rw.t FAILED
     
33.33%
t/blocks/splatty_in_caller_position.t OK
       
100.00%
t/blocks/splatty_with_type.t OK
 
100.00%
t/blocks/statement_control.t OK
 
100.00%
t/blocks/sub_arg_errors.t OK
           
100.00%
t/blocks/sub_bug.t OK
 
100.00%
t/blocks/sub_named_params.t FAILED
                                                               
                                                             
28.57%
t/blocks/sub_parameter_traits.t OK
                       
100.00%
t/blocks/sub_ref.t OK
                                                                 
100.00%
t/blocks/sub_return_object_method_call.t OK
                   
100.00%
t/blocks/sub_return_values.t OK
                                                               
                                                             
100.00%
t/blocks/subroutine.t FAILED
                                 
76.47%
t/blocks/unhashify.t OK
     
100.00%
t/blocks/wrap.t OK
                                       
100.00%
t/builtins/arity.t OK
                                 
100.00%
t/builtins/arrays/elems.t FAILED
                       
83.33%
t/builtins/arrays/end.t FAILED
                           
92.86%
t/builtins/arrays/init-in-exported-sub.t FAILED
 
0.00%
t/builtins/arrays/isa.t OK
                                     
100.00%
t/builtins/bool/not.t OK
                   
100.00%
t/builtins/bool/true.t OK
                   
100.00%
t/builtins/caller.t FAILED
                                     
47.37%
t/builtins/container/each.t OK
               
100.00%
t/builtins/control_flow/die_and_end.t OK
 
100.00%
t/builtins/control_flow/fail.t OK
       
100.00%
t/builtins/control_flow/leave.t OK
                                             
100.00%
t/builtins/control_flow/return.t OK
             
100.00%
t/builtins/control_flow/try.t OK
                                                 
100.00%
t/builtins/fmt.t OK
                                     
100.00%
t/builtins/lists/sum.t OK
           
100.00%
t/builtins/math/NaN.t OK
           
100.00%
t/builtins/math/complex_powers.t FAILED
     
33.33%
t/builtins/math/infinity.t OK
               
100.00%
t/builtins/math/pi_internals.t OK
 
100.00%
t/builtins/my.t FAILED
                                                         
96.55%
t/builtins/perl.t OK
                                                                                                     
                                                                                                     
100.00%
t/builtins/perl2.t OK
                                                                                                 
                                                                                                 
100.00%
t/builtins/ref.t OK
                               
100.00%
t/builtins/sigils.t FAILED
                                                                           
5.26%
t/builtins/strings/append.t OK
       
100.00%
t/builtins/strings/match.t OK
                 
100.00%
t/builtins/strings/subst.t FAILED
                       
83.33%
t/builtins/strings/unicode.t FAILED
                                                                                                 
10.20%
t/builtins/system/crypt.t OK
     
100.00%
t/closure_traits/ascending_order.t OK
               
100.00%
t/closure_traits/check.t OK
         
100.00%
t/closure_traits/descending_order.t OK
             
100.00%
t/closure_traits/enter_leave.t FAILED
                     
36.36%
t/closure_traits/exit_in_begin.t OK
   
100.00%
t/closure_traits/exit_in_check.t OK
   
100.00%
t/closure_traits/first.t FAILED
       
25.00%
t/closure_traits/in_eval.t FAILED
                                   
50.00%
t/closure_traits/in_loop.t FAILED
   
0.00%
t/closure_traits/init.t FAILED
                     
90.91%
t/closure_traits/interpolate.t OK
           
100.00%
t/closure_traits/keep_undo.t FAILED
                   
30.00%
t/closure_traits/multiple.t OK
   
100.00%
t/closure_traits/next.t FAILED
                         
53.85%
t/closure_traits/pre_post.t FAILED
                               
50.00%
t/closure_traits/rvalue.t OK
                   
100.00%
t/closure_traits/start.t FAILED
                                         
38.10%
t/data_types/anon_block.t OK
                                                               
100.00%
t/data_types/array.t FAILED
                                                                       
                                                                     
98.59%
t/data_types/array_extending.t OK
                       
100.00%
t/data_types/array_mmd.t OK
       
100.00%
t/data_types/array_ref.t OK
                                                                                         
100.00%
t/data_types/autovivification.t FAILED
 
0.00%
t/data_types/bool.t OK
                                   
100.00%
t/data_types/capture.t FAILED
                                   
77.78%
t/data_types/catch_type_cast_mismatch.t OK
       
100.00%
t/data_types/enum.t OK
                                                           
100.00%
t/data_types/flattening.t OK
                                                                   
100.00%
t/data_types/hash.t OK
                                                         
                                                         
100.00%
t/data_types/hash_ref.t OK
                                                               
100.00%
t/data_types/lazy_lists.t OK
                                                               
100.00%
t/data_types/lists.t OK
                               
100.00%
t/data_types/mixed_multi_dimensional.t OK
                                                                             
                                                                           
100.00%
t/data_types/multi_dimensional_array.pugs FAILED
                                                             
100.00%
t/data_types/nested_arrays.t OK
               
100.00%
t/data_types/nested_pairs.t OK
             
100.00%
t/data_types/num.t FAILED
                                                                                             
97.87%
t/data_types/pair.t OK
                                                                                                 
                                                                                               
100.00%
t/data_types/subscripts_and_context.t OK
               
100.00%
t/data_types/subtypes.t OK
                         
100.00%
t/examples/99problems/problem01.t OK
   
100.00%
t/examples/99problems/problem02.t OK
   
100.00%
t/examples/99problems/problem03.t OK
       
100.00%
t/examples/99problems/problem04.t OK
   
100.00%
t/examples/99problems/problem05.t OK
   
100.00%
t/examples/99problems/problem06.t OK
   
100.00%
t/examples/99problems/problem07.t OK
   
100.00%
t/examples/99problems/problem08.t OK
   
100.00%
t/examples/99problems/problem09.t OK
     
100.00%
t/examples/99problems/problem10.t OK
 
100.00%
t/examples/99problems/problem11.t OK
 
100.00%
t/examples/99problems/problem12.t OK
 
100.00%
t/examples/99problems/problem13.t FAILED
               
75.00%
t/examples/99problems/problem14.t OK
   
100.00%
t/examples/99problems/problem15.t OK
 
100.00%
t/examples/99problems/problem16.t FAILED
         
60.00%
t/examples/99problems/problem17.t OK
   
100.00%
t/examples/99problems/problem18.t OK
 
100.00%
t/examples/99problems/problem19.t OK
   
100.00%
t/examples/99problems/problem20.t OK
   
100.00%
t/examples/99problems/problem21.t OK
 
100.00%
t/examples/99problems/problem22.t OK
 
100.00%
t/examples/99problems/problem23.t OK
         
100.00%
t/examples/99problems/problem24.t OK
     
100.00%
t/examples/99problems/problem25.t OK
 
100.00%
t/examples/99problems/problem26.t OK
 
100.00%
t/examples/99problems/problem27.t OK
 
100.00%
t/examples/99problems/problem28.t OK
   
100.00%
t/examples/99problems/problem31.t OK
                   
100.00%
t/examples/99problems/problem32.t OK
       
100.00%
t/examples/99problems/problem33.t OK
     
100.00%
t/examples/99problems/problem34.t OK
                                       
100.00%
t/examples/99problems/problem35.t OK
 
100.00%
t/examples/99problems/problem36.t OK
         
100.00%
t/examples/99problems/problem37.t OK
                                       
100.00%
t/examples/99problems/problem38.t OK
 
100.00%
t/examples/99problems/problem39.t OK
   
100.00%
t/examples/99problems/problem40.t OK
 
100.00%
t/examples/99problems/problem41.t OK
 
100.00%
t/examples/99problems/problem46.t OK
 
100.00%
t/examples/99problems/problem47.t OK
 
100.00%
t/examples/99problems/problem48.t OK
 
100.00%
t/examples/99problems/problem49.t OK
           
100.00%
t/examples/99problems/problem50.t OK
 
100.00%
t/examples/99problems/problem54.t OK
         
100.00%
t/examples/99problems/problem55.t OK
 
100.00%
t/examples/99problems/problem56.t OK
                 
100.00%
t/examples/99problems/problem57.t OK
 
100.00%
t/examples/99problems/problem58.t OK
 
100.00%
t/examples/99problems/problem59.t OK
 
100.00%
t/examples/99problems/problem60.t OK
 
100.00%
t/examples/99problems/problem61.t OK
   
100.00%
t/examples/99problems/problem62.t OK
       
100.00%
t/examples/99problems/problem63.t OK
 
100.00%
t/examples/99problems/problem64.t OK
 
100.00%
t/examples/99problems/problem65.t OK
 
100.00%
t/examples/99problems/problem66.t OK
 
100.00%
t/examples/99problems/problem67.t OK
   
100.00%
t/examples/99problems/problem68.t OK
 
100.00%
t/examples/99problems/problem69.t OK
 
100.00%
t/examples/99problems/problem70.t OK
 
100.00%
t/examples/99problems/problem71.t OK
 
100.00%
t/examples/99problems/problem72.t OK
 
100.00%
t/examples/99problems/problem73.t OK
 
100.00%
t/examples/99problems/problem80.t OK
 
100.00%
t/examples/99problems/problem81.t OK
 
100.00%
t/examples/99problems/problem82.t OK
 
100.00%
t/examples/99problems/problem83.t OK
 
100.00%
t/examples/99problems/problem84.t OK
 
100.00%
t/examples/99problems/problem85.t OK
 
100.00%
t/examples/99problems/problem86.t OK
 
100.00%
t/examples/99problems/problem87.t OK
 
100.00%
t/examples/99problems/problem88.t OK
 
100.00%
t/examples/99problems/problem89.t OK
 
100.00%
t/examples/99problems/problem90.t OK
                                                                                             
                                                                                           
100.00%
t/examples/99problems/problem91.t OK
 
100.00%
t/examples/99problems/problem92.t OK
 
100.00%
t/examples/99problems/problem93.t OK
 
100.00%
t/examples/99problems/problem94.t OK
 
100.00%
t/examples/99problems/problem95.t OK
 
100.00%
t/examples/99problems/problem96.t OK
       
100.00%
t/examples/99problems/problem97.t OK
 
100.00%
t/examples/99problems/problem98.t OK
                   
100.00%
t/examples/all_parse.t FAILED
                                                                                                 
                                                                                                 
                                                                                                 
                                                                                               
90.77%
t/examples/examples.t OK
                                               
100.00%
t/examples/golf.t OK
                   
100.00%
t/examples/golfex.t OK
               
100.00%
t/general/atoms.t OK
                                 
100.00%
t/general/basic.t FAILED
                             
93.33%
t/general/config.t OK
       
100.00%
t/junction/abc.t OK
       
100.00%
t/junction/any_values_infinite_loop.t OK
 
100.00%
t/junction/array_deref.t OK
 
100.00%
t/junction/associative.t OK
                           
100.00%
t/junction/chained_operators.t OK
             
100.00%
t/junction/junction_any_pick.t OK
   
100.00%
t/junction/junction_functions.t OK
                                             
100.00%
t/junction/junction_pick.t OK
 
100.00%
t/junction/misc_junctions.t FAILED
                                                                           
                                                                           
96.05%
t/junction/s09eg.t OK
     
100.00%
t/macros/caller.t FAILED
       
50.00%
t/macros/closure_returning_macros.t FAILED
       
75.00%
t/macros/macro_code_test.t OK
     
100.00%
t/macros/opaque_ast_macros.t OK
         
100.00%
t/macros/operator_macros.t OK
 
100.00%
t/macros/string_returning_macros.t OK
               
100.00%
t/magicals/block.t OK
 
100.00%
t/magicals/caller_pos.t OK
               
100.00%
t/magicals/dollar_underscore.t FAILED
 
0.00%
t/magicals/env.t OK
                           
100.00%
t/magicals/file_line.t OK
   
100.00%
t/magicals/inc.t OK
     
100.00%
t/magicals/line_basic.t OK
                     
100.00%
t/magicals/pid.t OK
 
100.00%
t/magicals/progname.t OK
 
100.00%
t/magicals/sub.t OK
       
100.00%
t/magicals/subname.t FAILED
       
75.00%
t/oo/attributes/array.t OK
 
100.00%
t/oo/attributes/attribute_initialization.t OK
               
100.00%
t/oo/attributes/attribute_list.t OK
           
100.00%
t/oo/attributes/class.t FAILED
                                 
64.71%
t/oo/attributes/defaults.t OK
                                         
100.00%
t/oo/attributes/instance.t OK
                                                                       
                                                                     
100.00%
t/oo/attributes/is_rw_on_class.t OK
     
100.00%
t/oo/attributes/methods_on_typed_attrs.t OK
             
100.00%
t/oo/attributes/mutators.t OK
                                                 
100.00%
t/oo/attributes/recursive.t FAILED
                                     
36.84%
t/oo/attributes/undeclared_attribute.t OK
                       
100.00%
t/oo/autopair_instantiation.t OK
       
100.00%
t/oo/can.t OK
   
100.00%
t/oo/class/anonymous.t OK
         
100.00%
t/oo/class/basic.t OK
                                         
100.00%
t/oo/class/indirect_notation.t OK
           
100.00%
t/oo/class/inherit_from_role.t OK
       
100.00%
t/oo/class/inheritance.t OK
 
100.00%
t/oo/class/literal.t OK
   
100.00%
t/oo/class/nested_use.t OK
                 
100.00%
t/oo/class_inclusion_with_inherited_class.t OK
 
100.00%
t/oo/class_inheritance_become_infinite_loop.t OK
 
100.00%
t/oo/class_name_and_attribute_name_confliction.t OK